{"text_format":"1","workbook":"xlsx","n_sheets":26,"sheets":["Gennaio","Febbraio","Marzo","Aprile","Maggio","Giugno","Luglio","Agosto","Settembre","Ottobre","Novembre","Dicembre","Tutto","Click","Deposito","Planner","Tabelle","Tabloid","MacroTotali","Scadenzario","IPhone","Monica","Andrea","Ristrutturazione Piazza","Piano ammortamento","Foglio1"],"not_rendered":{"charts":0,"images":3,"macros":1,"external_links":2,"defined_names":65,"comments":20,"pivot_tables":1},"unopened":[],"bounds":{"document_bytes":16777216,"sheet_cells":100000,"rows_first":2000,"rows_last":500,"rows_between":2000,"halvings":0,"cell_chars":16384,"cell_head_chars":4096},"cells_cut":0,"cells_raw":0,"read":"whole","date_system":"1900"}

{"sheet":"Gennaio","index":0,"n_rows":72,"n_cols":32,"rows_kept":72,"cut":false,"hidden":false,"merged":[]}
["Oggi è",null,"FcaBank","Arancio","Totale"]
[{"$f":"TODAY()","v":"2024-03-31"},null,{"$f":"Deposito!$R$20","v":15000},{"$f":"Deposito!$O$20","v":15000},{"$f":"SUM(C2+D2+E3)","v":30125.95},null,null,{"$f":"VLOOKUP($A$2,$A6:$E97,5)","v":125.94999999999959}]
[null,null,null,null,{"$f":"LOOKUP(2,1/(E:E<>\"\"),E:E)","v":125.94999999999959}]
["DATA","OPERAZIONE","DARE","AVERE","SALDO",null,null,null,null,"DARE"]
[null,null,null,null,{"$f":"Saldo_2023","v":141.44999999999999},null,null,null,null,null,null,null,null,null,null,null,null,null,null,null,null,null,null,null,null,"Giorni","Numeri","Numeri Per Calcolo Interessi","Interessi Lordi","Interessi Netti","Tasso Interessi","Ritenuta"]
["2024-01-01","Genius",2.15,null,{"$f":"IF(AND($A6=0),\"\",$E5-$C6+$D6)","v":139.29999999999998},null,null,null,null,4.96,null,null,null,null,null,null,null,null,null,null,null,null,null,null,null,{"$f":"IF(#REF!-A6<0,0,SUM(#REF!-A6))","v":{"$error":"#REF!"}},{"$f":"SUM(C6:D6)","v":2.15},{"$f":"E6*Z6","v":{"$error":"#REF!"}},{"$f":"(AB6*AE6/100)/365","v":{"$error":"#REF!"}},{"$f":"AC6-AF6","v":{"$error":"#REF!"}},1,{"$f":"(AC6*27/100)","v":{"$error":"#REF!"}}]
{"$rows_left_out":67}
{"sheet":"Febbraio","index":1,"n_rows":38,"n_cols":8,"rows_kept":38,"cut":false,"hidden":false,"merged":[]}
["Oggi è",null,"FcaBank","Arancio","Totale"]
[{"$f":"TODAY()","v":"2024-03-31"},null,{"$f":"Deposito!$R$20","v":15000},{"$f":"Deposito!$O$20","v":15000},{"$f":"SUM(C2+D2+E3)","v":30789.51},null,null,{"$f":"VLOOKUP($A$2,$A$6:$E$76,5)","v":789.50999999999954}]
[null,null,null,null,{"$f":"LOOKUP(2,1/(E:E<>\"\"),E:E)","v":789.50999999999954}]
["DATA","OPERAZIONE","DARE","AVERE","€   SALDO"]
[null,null,null,null,{"$f":"Gennaio!$E$3","v":125.94999999999959}]
["2024-02-01","Genius",2.15,null,{"$f":"IF(AND(A6=0),\"\",E5-C6+D6)","v":123.79999999999959}]
{"$rows_left_out":33}
{"sheet":"Marzo","index":2,"n_rows":36,"n_cols":29,"rows_kept":36,"cut":false,"hidden":false,"merged":[]}
["Oggi è",null,"FcaBank","Arancio","Totale"]
[{"$f":"TODAY()","v":"2024-03-31"},null,{"$f":"Deposito!R20","v":15000},{"$f":"Deposito!O20","v":15000},{"$f":"SUM($C$2+$D$2+$E$3)","v":30685.64},{"$f":"VLOOKUP($A$2,$A$6:$E$63,5)","v":685.63999999999942}]
[null,null,null,null,{"$f":"LOOKUP(2,1/(E:E<>\"\"),E:E)","v":685.63999999999942}]
["DATA","OPERAZIONE","DARE","AVERE","€   SALDO"]
[null,null,null,null,{"$f":"Febbraio!$E$3","v":789.50999999999954},null,null,null,null,null,null,null,null,null,null,null,null,null,null,null,null,null,"Giorni","Numeri","Numeri Per Calcolo Interessi","Interessi Lordi","Interessi Netti","Tasso Interessi","Ritenuta"]
["2024-03-01","Genius",2.15,null,{"$f":"IF(AND(A6=0),\"\",E5-C6+D6)","v":787.35999999999956},null,null,null,null,null,null,null,null,null,null,null,null,null,null,null,null,null,{"$f":"IF(#REF!-A6<0,0,SUM(#REF!-A6))","v":{"$error":"#REF!"}},{"$f":"SUM(C6:D6)","v":2.15},{"$f":"E6*W6","v":{"$error":"#REF!"}},{"$f":"(Y6*AB6/100)/365","v":{"$error":"#REF!"}},{"$f":"Z6-AC6","v":{"$error":"#REF!"}},1,{"$f":"(Z6*27/100)","v":{"$error":"#REF!"}}]
{"$rows_left_out":31}
{"sheet":"Aprile","index":3,"n_rows":41,"n_cols":31,"rows_kept":41,"cut":false,"hidden":false,"merged":[[0,6,0,7],[0,8,0,12]]}
["Oggi è",null,"FcaBank","Arancio","Totale"]
[{"$f":"TODAY()","v":"2024-03-31"},null,{"$f":"Deposito!$R$20","v":15000},{"$f":"Deposito!$O$20","v":15000},{"$f":"SUM($C$2+$D$2+$E$3)","v":29603.17},null,{"$f":"VLOOKUP(A2,A6:E36,5)","v":{"$error":"#N/A"}}]
[null,null,null,null,{"$f":"LOOKUP(2,1/(E:E<>\"\"),E:E)","v":-396.83000000000027}]
["DATA","OPERAZIONE","DARE","AVERE","€   SALDO"]
[null,null,null,null,{"$f":"Marzo!$E$3","v":685.63999999999942},null,null,null,null,null,null,null,null,null,null,null,null,null,null,null,null,null,null,null,"Giorni","Numeri","Numeri Per Calcolo Interessi","Interessi Lordi","Interessi Netti","Tasso Interessi","Ritenuta"]
["2024-04-01","Genius",2.15,null,{"$f":"IF(AND(A6=0),\"\",E5-C6+D6)","v":683.48999999999944},null,null,null,null,null,null,null,null,null,null,null,null,null,null,null,null,null,null,null,{"$f":"IF(#REF!-A6<0,0,SUM(#REF!-A6))","v":{"$error":"#REF!"}},{"$f":"SUM(C6:D6)","v":2.15},{"$f":"E6*Y6","v":{"$error":"#REF!"}},{"$f":"(AA6*AD6/100)/365","v":{"$error":"#REF!"}},{"$f":"AB6-AE6","v":{"$error":"#REF!"}},1,{"$f":"(AB6*27/100)","v":{"$error":"#REF!"}}]
{"$rows_left_out":36}
{"sheet":"Maggio","index":4,"n_rows":53,"n_cols":31,"rows_kept":53,"cut":false,"hidden":false,"merged":[]}
["Oggi è",null,"FcaBank","Arancio","Totale"]
[{"$f":"TODAY()","v":"2024-03-31"},null,{"$f":"Deposito!$R$20","v":15000},{"$f":"Deposito!$O$20","v":15000},{"$f":"SUM($C$2+$D$2+$E$3)","v":31712.59},null,{"$f":"VLOOKUP(A2,A6:E86,5)","v":{"$error":"#N/A"}}]
[null,null,null,null,{"$f":"LOOKUP(2,1/(E:E<>\"\"),E:E)","v":1712.5900000000008}]
["DATA","OPERAZIONE","DARE","AVERE","€   SALDO"]
[null,null,null,null,{"$f":"Aprile!$E$3","v":-396.83000000000027},null,null,null,null,null,null,null,null,null,null,null,null,null,null,null,null,null,null,null,"Giorni","Numeri","Numeri Per Calcolo Interessi","Interessi Lordi","Interessi Netti","Tasso Interessi","Ritenuta"]
["2024-05-01","Genius",2.15,null,{"$f":"IF(AND(A6=0),\"\",E5-C6+D6)","v":-398.98000000000025},null,null,null,null,null,null,null,null,null,null,null,null,null,null,null,null,null,null,null,{"$f":"IF(#REF!-A6<0,0,SUM(#REF!-A6))","v":{"$error":"#REF!"}},{"$f":"SUM(C6:D6)","v":2.15},{"$f":"E6*Y6","v":{"$error":"#REF!"}},{"$f":"(AA6*AD6/100)/365","v":{"$error":"#REF!"}},{"$f":"AB6-AE6","v":{"$error":"#REF!"}},1,{"$f":"(AB6*27/100)","v":{"$error":"#REF!"}}]
{"$rows_left_out":48}
{"sheet":"Giugno","index":5,"n_rows":54,"n_cols":31,"rows_kept":54,"cut":false,"hidden":false,"merged":[]}
["Oggi è",null,"FcaBank","Arancio","Totale"]
[{"$f":"TODAY()","v":"2024-03-31"},null,{"$f":"Deposito!$R$20","v":15000},{"$f":"Deposito!$O$20","v":15000},{"$f":"SUM($C$2+$D$2+$E$3)","v":29062.010000000002},null,{"$f":"VLOOKUP($A$2,$A6:$E96,5)","v":{"$error":"#N/A"}}]
[null,null,null,null,{"$f":"LOOKUP(2,1/(E:E<>\"\"),E:E)","v":-937.98999999999955}]
["DATA","OPERAZIONE","DARE","AVERE","€   SALDO"]
[null,null,null,null,{"$f":"Maggio!$E$3","v":1712.5900000000008},null,null,null,null,null,null,null,null,null,null,null,null,null,null,null,null,null,null,null,"Giorni","Numeri","Numeri Per Calcolo Interessi","Interessi Lordi","Interessi Netti","Tasso Interessi","Ritenuta"]
["2024-06-01","Genius",2.15,null,{"$f":"IF(AND(A6=0),\"\",E5-C6+D6)","v":1710.4400000000007},null,null,null,null,null,null,null,null,null,null,null,null,null,null,null,null,null,null,null,{"$f":"IF(#REF!-A6<0,0,SUM(#REF!-A6))","v":{"$error":"#REF!"}},{"$f":"SUM(C6:D6)","v":2.15},{"$f":"E6*Y6","v":{"$error":"#REF!"}},{"$f":"(AA6*AD6/100)/365","v":{"$error":"#REF!"}},{"$f":"AB6-AE6","v":{"$error":"#REF!"}},1,{"$f":"(AB6*27/100)","v":{"$error":"#REF!"}}]
{"$rows_left_out":49}
{"sheet":"Luglio","index":6,"n_rows":29,"n_cols":31,"rows_kept":29,"cut":false,"hidden":false,"merged":[[0,1,1,1]]}
["Oggi è",null,"FcaBank","Arancio","Totale"]
[{"$f":"TODAY()","v":"2024-03-31"},null,{"$f":"Deposito!$R$20","v":15000},{"$f":"Deposito!$O$20","v":15000},{"$f":"SUM($C$2+$D$2+$E$3)","v":28291.18},null,{"$f":"VLOOKUP($A$2,$A$6:$E$39,5)","v":{"$error":"#N/A"}}]
[null,null,null,null,{"$f":"LOOKUP(2,1/(E:E<>\"\"),E:E)","v":-1708.8199999999997}]
["DATA","OPERAZIONE","DARE","AVERE","€   SALDO"]
[null,null,null,null,{"$f":"Giugno!$E$3","v":-937.98999999999955},null,null,null,null,null,null,null,null,null,null,null,null,null,null,null,null,null,null,null,"Giorni","Numeri","Numeri Per Calcolo Interessi","Interessi Lordi","Interessi Netti","Tasso Interessi","Ritenuta"]
["2024-07-01","Genius",2.15,null,{"$f":"IF(AND(A6=0),\"\",E5-C6+D6)","v":-940.13999999999953},null,null,null,null,null,null,null,null,null,null,null,null,null,null,null,null,null,null,null,{"$f":"IF(#REF!-A6<0,0,SUM(#REF!-A6))","v":{"$error":"#REF!"}},{"$f":"SUM(C6:D6)","v":2.15},{"$f":"F6*Y6","v":{"$error":"#REF!"}},{"$f":"(AA6*AD6/100)/365","v":{"$error":"#REF!"}},{"$f":"AB6-AE6","v":{"$error":"#REF!"}},1,{"$f":"(AB6*27/100)","v":{"$error":"#REF!"}}]
{"$rows_left_out":24}
{"sheet":"Agosto","index":7,"n_rows":28,"n_cols":31,"rows_kept":28,"cut":false,"hidden":false,"merged":[[0,1,1,1]]}
["Oggi è",null,"FcaBank","Arancio","Totale",null,{"$f":"VLOOKUP($A$2,$A$6:$E$82,5)","v":{"$error":"#N/A"}}]
[{"$f":"TODAY()","v":"2024-03-31"},null,{"$f":"Deposito!$R$20","v":15000},{"$f":"Deposito!$O$20","v":15000},{"$f":"SUM($C$2+$D$2+$E$3)","v":31853.71}]
[null,null,null,null,{"$f":"LOOKUP(2,1/(E:E<>\"\"),E:E)","v":1853.71}]
["DATA","OPERAZIONE","DARE","AVERE","€   SALDO"]
[null,null,null,null,{"$f":"Luglio!$E$3","v":-1708.8199999999997},null,null,null,null,null,null,null,null,null,null,null,null,null,null,null,null,null,null,null,"Giorni","Numeri","Numeri Per Calcolo Interessi","Interessi Lordi","Interessi Netti","Tasso Interessi","Ritenuta"]
["2024-08-01","Genius",2.15,null,{"$f":"IF(AND(A6=0),\"\",E5-C6+D6)","v":-1710.9699999999998},null,null,null,null,null,null,null,null,null,null,null,null,null,null,null,null,null,null,null,{"$f":"IF(#REF!-A6<0,0,SUM(#REF!-A6))","v":{"$error":"#REF!"}},{"$f":"SUM(C6:D6)","v":2.15},{"$f":"E6*Y6","v":{"$error":"#REF!"}},{"$f":"(AA6*AD6/100)/365","v":{"$error":"#REF!"}},{"$f":"AB6-AE6","v":{"$error":"#REF!"}},1,{"$f":"(AB6*27/100)","v":{"$error":"#REF!"}}]
{"$rows_left_out":23}
{"sheet":"Settembre","index":8,"n_rows":39,"n_cols":7,"rows_kept":39,"cut":false,"hidden":false,"merged":[[0,8,0,12]]}
["Oggi è",null,"FcaBank","Arancio","Totale",{"$f":"SUMIF(Deposito!#REF!,\"Agosto\",Deposito!#REF!)","v":{"$error":"#REF!"}},{"$f":"VLOOKUP($A$2,$A6:$E78,5)","v":{"$error":"#N/A"}}]
[{"$f":"TODAY()","v":"2024-03-31"},null,{"$f":"Deposito!$R$20","v":15000},{"$f":"Deposito!$O$20","v":15000},{"$f":"SUM($C$2+$D$2+$E$3)","v":28236.05}]
[null,null,null,null,{"$f":"LOOKUP(2,1/(E:E<>\"\"),E:E)","v":-1763.950000000001}]
["DATA","OPERAZIONE","DARE","AVERE","€   SALDO"]
[null,null,null,null,{"$f":"Agosto!$E$3","v":1853.71}]
["2024-09-01","Genius",2.15,null,{"$f":"IF(AND(A6=0),\"\",E5-C6+D6)","v":1851.56}]
{"$rows_left_out":34}
{"sheet":"Ottobre","index":9,"n_rows":113,"n_cols":7,"rows_kept":113,"cut":false,"hidden":false,"merged":[]}
["Oggi è",null,"FcaBank","Arancio","Totale"]
[{"$f":"TODAY()","v":"2024-03-31"},null,{"$f":"Deposito!$R$20","v":15000},{"$f":"Deposito!$O$20","v":15000},{"$f":"SUM($C$2+$D$2+$E$3)","v":28796.46},null,{"$f":"VLOOKUP(A2,A6:E79,5)","v":{"$error":"#N/A"}}]
[null,null,null,null,{"$f":"LOOKUP(2,1/(E:E<>\"\"),E:E)","v":-1203.5400000000016}]
["DATA","OPERAZIONE","DARE","AVERE","SALDO"]
[null,null,null,null,{"$f":"Settembre!$E$3","v":-1763.950000000001}]
["2024-10-01","Genius",2.15,null,{"$f":"IF(AND(A6=0),\"\",E5-C6+D6)","v":-1766.100000000001}]
{"$rows_left_out":108}
{"sheet":"Novembre","index":10,"n_rows":37,"n_cols":31,"rows_kept":37,"cut":false,"hidden":false,"merged":[]}
["Oggi è",null,"FcaBank","Arancio","Totale"]
[{"$f":"TODAY()","v":"2024-03-31"},null,{"$f":"Deposito!$R$20","v":15000},{"$f":"Deposito!$O$20","v":15000},{"$f":"SUM($C$2+$D$2+$E$3)","v":28347.61},null,{"$f":"VLOOKUP($A$2,$A$6:$E$85,5)","v":{"$error":"#N/A"}}]
[null,null,null,null,{"$f":"LOOKUP(2,1/(E:E<>\"\"),E:E)","v":-1652.3900000000012},null,{"$f":"VLOOKUP($A$2,$A$6:$E$85,6)","v":{"$error":"#N/A"}}]
["DATA","OPERAZIONE","DARE","AVERE","SALDO"]
[null,null,null,null,{"$f":"Ottobre!$E$3","v":-1203.5400000000016},null,null,null,null,null,null,null,null,null,null,null,null,null,null,null,null,null,null,null,"Giorni","Numeri","Numeri Per Calcolo Interessi","Interessi Lordi","Interessi Netti","Tasso Interessi","Ritenuta"]
["2024-11-01","Genius",2.15,null,{"$f":"IF(AND(A6=0),\"\",E5-C6+D6)","v":-1205.6900000000016},null,null,null,null,null,null,null,null,null,null,null,null,null,null,null,null,null,null,null,{"$f":"IF(#REF!-A6<0,0,SUM(#REF!-A6))","v":{"$error":"#REF!"}},{"$f":"SUM(C6:D6)","v":2.15},{"$f":"E6*Y6","v":{"$error":"#REF!"}},{"$f":"(AA6*AD6/100)/365","v":{"$error":"#REF!"}},{"$f":"AB6-AE6","v":{"$error":"#REF!"}},1,{"$f":"(AB6*27/100)","v":{"$error":"#REF!"}}]
{"$rows_left_out":32}
{"sheet":"Dicembre","index":11,"n_rows":46,"n_cols":14,"rows_kept":46,"cut":false,"hidden":false,"merged":[[34,7,34,8],[34,9,34,13]]}
["Oggi è",null,"FcaBank","Arancio","Totale"]
[{"$f":"TODAY()","v":"2024-03-31"},null,{"$f":"Deposito!$R$20","v":15000},{"$f":"Deposito!$O$20","v":15000},{"$f":"SUM($C$2+$D$2+$E$3)","v":28265.64},{"$f":"VLOOKUP(A2,A6:E100,5)","v":{"$error":"#N/A"}}]
[null,null,null,null,{"$f":"LOOKUP(2,1/(E:E<>\"\"),E:E)","v":-1734.360000000001}]
["DATA","OPERAZIONE","DARE","AVERE","SALDO"]
[null,null,null,null,{"$f":"Novembre!$E$3","v":-1652.3900000000012}]
["2024-12-01","Genius",2.15,null,{"$f":"IF(AND(A6=0),\"\",E5-C6+D6)","v":-1654.5400000000013}]
{"$rows_left_out":41}
{"sheet":"Tutto","index":12,"n_rows":88,"n_cols":10,"rows_kept":88,"cut":false,"hidden":false,"merged":[]}
[]
[]
[]
["DATA","OPERAZIONE","DARE","AVERE","SALDO"]
[null,null,null,null,{"$f":"Saldo_2023","v":141.44999999999999}]
["2024-01-01","Genius",2.15,null,{"$f":"IF(AND($A6=0),\"\",$E5-$C6+$D6)","v":139.29999999999998},null,"Etichette di riga","Somma di DARE","Somma di AVERE"]
{"$rows_left_out":83}
{"sheet":"Click","index":13,"n_rows":104,"n_cols":10,"rows_kept":104,"cut":false,"hidden":false,"merged":[[0,3,1,3]]}
[null,null,"Oggi è",null,"Totale Dare","Totale Avere",null,"Saldo Euro",null,{"$f":"VLOOKUP($C$2,$C4:$H163,6)","v":10.949999999999976}]
[null,null,{"$f":"TODAY()","v":"2024-03-31"},null,{"$f":"SUM(E4:E287)","v":391.36000000000007},{"$f":"SUM(F4:F20)","v":196},null,{"$f":"LOOKUP(2,1/(H:H<>\"\"),H:H)","v":10.949999999999976}]
[null,null,"DATA","OPERAZIONE","DARE","AVERE","NOME","€   SALDO"]
[null,null,"2023-12-31",null,null,null,null,7.31]
[null,null,"2024-01-01","Accredito",null,49,null,{"$f":"IF(AND(C5=0),\"\",$H4-$E5+$F5)","v":56.31}]
[null,null,"2024-01-03","Prelievo",9.99,null,"Iliad",{"$f":"IF(AND(C6=0),\"\",$H5-$E6+$F6)","v":46.32}]
{"$rows_left_out":99}
{"sheet":"Deposito","index":14,"n_rows":20,"n_cols":21,"rows_kept":20,"cut":false,"hidden":false,"merged":[[1,12,1,18],[3,16,3,17],[3,13,3,14]]}
[]
[null,"2023-10-18",null,null,null,null,null,null,null,null,null,null,{"$f":"SUM(U7+U5+U6)","v":30789.510000000002}]
[null,"Vincolati","Interessi","Totale","Tassa","Totale tasse","Netto annuale","Netto mensile","Netto giorno"]
[null,15000,4.2999999999999997E-2,{"$f":"B4*C4","v":645},0.2,{"$f":"D4*E4","v":129},{"$f":"D4-F4","v":516},{"$f":"G4/12","v":43},{"$f":"H4/31","v":1.3870967741935485},null,null,null,null,"Arancio",null,null,"FcaBank"]
[null,null,null,null,null,null,null,null,null,null,null,null,null,null,null,null,null,null,null,"Arancio",{"$f":"LOOKUP(2,1/(O:O<>\"\"),O:O)","v":15000}]
[null,"Vincolati","importo","tasso lordo","tasso netto","imposta bollo","Interesse netto annuale","Interesse trimestrale","Vincolo",null,null,null,null,"2024-01-01",12000,null,"2023-10-18",15000,null,"FcaBank",{"$f":"LOOKUP(2,1/(R:R<>\"\"),R:R)","v":15000}]
{"$rows_left_out":15}
{"sheet":"Planner","index":15,"n_rows":68,"n_cols":17,"rows_kept":68,"cut":false,"hidden":false,"merged":[[0,0,0,16]]}
["PLANNER"]
["MEDIE","OPERAZIONI","Gennaio",null,null,null,null,null,null,null,null,null,null,null,"TOTALI","%","OPERAZIONI"]
[]
[{"$f":"AVERAGE(C4:N4)","v":108.07666666666667},"AcquaEnna",{"$f":"SUMIF(Gennaio!$B$6:$B$100,$B4,Gennaio!$C$6:$C$100)","v":0},{"$f":"SUMIF(Febbraio!$B$6:$B$100,$B4,Febbraio!$C$6:$C$100)","v":0},{"$f":"SUMIF(Marzo!$B$6:$B$100,$B4,Marzo!$C$6:$C$100)","v":324.23},null,null,null,null,null,null,null,null,null,{"$f":"SUM($C4:$N4)","v":324.23},{"$f":"IF($O4,$O4/$O$68,\"\")","v":1.493470929988858E-2},"AcquaEnna"]
[0,"Amministratore",{"$f":"SUMIF(Gennaio!$B$6:$B$100,$B5,Gennaio!$C$6:$C$100)","v":0},{"$f":"SUMIF(Febbraio!$B$6:$B$100,$B5,Febbraio!$C$6:$C$100)","v":0},{"$f":"SUMIF(Marzo!$B$6:$B$100,$B5,Marzo!$C$6:$C$100)","v":0},null,null,null,null,null,null,null,null,null,{"$f":"SUM($C5:$N5)","v":0},{"$f":"IF($O5,$O5/$O$68,\"\")","v":""},"Amministratore"]
[216.66666666666666,"Andrea",{"$f":"SUMIF(Gennaio!$B$6:$B$100,$B6,Gennaio!$C$6:$C$100)","v":150},{"$f":"SUMIF(Febbraio!$B$6:$B$100,$B6,Febbraio!$C$6:$C$100)","v":250},{"$f":"SUMIF(Marzo!$B$6:$B$100,$B6,Marzo!$C$6:$C$100)","v":250},null,null,null,null,null,null,null,null,null,650,2.9940354208208914E-2,"Andrea"]
{"$rows_left_out":63}
{"sheet":"Tabelle","index":16,"n_rows":65,"n_cols":23,"rows_kept":65,"cut":false,"hidden":false,"merged":[[3,4,4,4]]}
[]
[null,null,null,null,null,null,{"$f":"TODAY()","v":"2024-03-31"},{"$f":"YEAR(G2)","v":2024},"Gen","Feb","Mar","Apr","Mag","Giu","Lug","Ago","Set","Ott","Nov","Dic"]
[null,null,null,null,null,null,null,null,1,2,3,4,5,6,7,8,9,10,11,12]
[null,null,null,null,"CAUSALE"]
[null,null,null,null,null,null,null,null,{"$f":"DATE($H$2,I$3,1)","v":"2024-01-01"},"2024-02-01","2024-03-01","2024-04-01","2024-05-01","2024-06-01","2024-07-01","2024-08-01","2024-09-01","2024-10-01","2024-11-01","2024-12-01",null,"Saldo 2010",1336.59]
[null,null,null,1,"AcquaEnna",null,"PAGATO",null,{"$f":"I5+1","v":"2024-01-02"},{"$f":"J5+1","v":"2024-02-02"},{"$f":"K5+1","v":"2024-03-02"},{"$f":"L5+1","v":"2024-04-02"},{"$f":"M5+1","v":"2024-05-02"},{"$f":"N5+1","v":"2024-06-02"},{"$f":"O5+1","v":"2024-07-02"},{"$f":"P5+1","v":"2024-08-02"},{"$f":"Q5+1","v":"2024-09-02"},{"$f":"R5+1","v":"2024-10-02"},{"$f":"S5+1","v":"2024-11-02"},{"$f":"T5+1","v":"2024-12-02"},null,"Saldo 2011",930.52]
{"$rows_left_out":60}
{"sheet":"Tabloid","index":17,"n_rows":102,"n_cols":24,"rows_kept":102,"cut":false,"hidden":false,"merged":[[0,21,0,23],[49,1,49,3],[49,5,49,7],[49,9,49,11],[49,13,49,15],[49,17,49,19],[0,1,0,3],[0,5,0,7],[0,9,0,11],[0,13,0,15],[0,17,0,19],[49,21,49,23]]}
[null,"Gennaio",null,null,null,"Febbraio",null,null,null,"Marzo",null,null,null,"Aprile",null,null,null,"Maggio",null,null,null,"Giugno"]
[null,null,"Uscite","Entrate",null,null,"Uscite","Entrate",null,null,"Uscite","Entrate",null,null,"Uscite","Entrate",null,null,"Uscite","Entrate",null,null,"Uscite","Entrate"]
[null,null,null,141.44999999999999,null,null,null,125.94999999999959,null,null,null,789.50999999999954,null,null,null,1053.4699999999996,null,null,null,-5499.24,null,null,null,-2992.2099999999991]
[null,"Genius",2.15,null,null,"Genius",2.15,null,null,"Genius",2.15,null,null,"Genius",2.15,null,null,"Genius",2.15,null,null,"Genius",2.15]
[null,"Carta Click Ricarica",50,null,null,"Pensione Claudio",null,1949.85,null,"Pensione Claudio",null,2006.02,null,"Competenze Banca",8.43,null,null,"Pensione Claudio",null,1865.9,null,"Pensione Claudio",null,1865.9]
[null,"Gasolio Golf",20,null,null,"Pensione Rosalba",null,1676.78,null,"Pensione Rosalba",null,1726.57,null,"Pensione Claudio",null,1962.7,null,"Pensione Rosalba",null,1586.02,null,"Pensione Rosalba",null,1586.02]
{"$rows_left_out":97}
{"sheet":"MacroTotali","index":18,"n_rows":269,"n_cols":16,"rows_kept":269,"cut":false,"hidden":false,"merged":[]}
[null,null,null,null,null,null,null,null,null,null,null,null,"€   SALDO"]
[null,null,null,null,null,null,null,null,null,null,null,null,{"$f":"Saldo_2022","v":-338.59},null,null,{"$f":"VLOOKUP(Tabelle!G2,I3:M500,5)","v":149.14999999999733}]
[null,null,null,null,null,null,null,null,"2023-01-03","Genius",4.96,null,{"$f":"$M2-$K3+$L3","v":-343.54999999999995}]
[null,null,null,null,null,null,null,null,"2023-01-03","Competenze Banca",8.6199999999999992,null,{"$f":"$M3-$K4+$L4","v":-352.16999999999996}]
[null,null,null,null,null,null,null,null,"2023-01-03","Pensione Claudio",null,1781.92,1429.75]
["2024-02-01","Genius",2.15,null,null,null,null,null,"2023-01-03","Pensione Rosalba",null,1590.65,3020.4]
{"$rows_left_out":264}
{"sheet":"Scadenzario","index":19,"n_rows":17,"n_cols":20,"rows_kept":17,"cut":false,"hidden":false,"merged":[[6,15,6,16]]}
[]
[]
[]
[]
[]
[null,null,"Gennaio","Febbraio","Marzo","Aprile","Maggio","Giugno","Luglio","Agosto","Settembre","Ottobre","Novembre","Dicembre",null,null,null,"TOTALE","DATO","DA DARE"]
{"$rows_left_out":12}
{"sheet":"IPhone","index":20,"n_rows":19,"n_cols":15,"rows_kept":19,"cut":false,"hidden":false,"merged":[]}
[]
[]
[]
[]
[null,null,null,null,null,null,null,null,null,null,null,null,"mensile",null,"totale"]
[]
{"$rows_left_out":14}
{"sheet":"Monica","index":21,"n_rows":160,"n_cols":12,"rows_kept":160,"cut":false,"hidden":false,"merged":[[135,3,138,3],[2,0,2,1],[2,2,3,2],[2,3,3,3],[71,3,74,3],[131,0,131,14]]}
["Rapporto IT 81 R 02008 31035 000001138967 - CAMPAGNA CLAUDIO, TERMINI ROSALBA"]
[]
["Data",null,"Descrizione","EUR",null,null,null,"già dati","da dare"]
["Operazione","Valuta",null,null,null,null,null,"NUMERO","RATE"]
["2008-06-04","2008-06-04","DISPOSIZIONE DI BONIFICO BONIFICO A GALANTE/CAMPAGNA PER VERSAMENTO DA PAPA  COMM.        4,00",20004]
["2008-07-28","2008-07-28","DISPOSIZIONE DI BONIFICO BONIFICO A  GALANTE MANUEL CAMPAGNA MONICA PER CONTRIBUTO MUTUO COMM.      1,00",-201,null,{"$f":"-D5","v":-20004},null,1,59,null,null,"Totali"]
{"$rows_left_out":155}
{"sheet":"Andrea","index":22,"n_rows":160,"n_cols":12,"rows_kept":160,"cut":false,"hidden":false,"merged":[[135,3,138,3],[2,0,2,1],[2,2,3,2],[2,3,3,3],[72,3,75,3],[131,0,131,14]]}
["Rapporto IT 81 R 02008 31035 000001138967 - CAMPAGNA CLAUDIO, TERMINI ROSALBA"]
[]
["Data",null,"Descrizione","EUR",null,null,null,"già dati","da dare"]
["Operazione","Valuta",null,null,null,null,null,"NUMERO","RATE"]
["2008-06-04","2008-06-04","DISPOSIZIONE DI BONIFICO BONIFICO A CAMPAGNA ANDREA PER VERSAMENTO DA PAPA  COMM.        3,00",-20003]
["2009-06-10","2009-06-04","DISPOSIZIONE DI BONIFICO BONIFICO A  CAMPAGNA ANDREA PER CONTRIBUTO MUTUO MAMMA PAP",-200,null,{"$f":"D5","v":-20003},null,1,59]
{"$rows_left_out":155}
{"sheet":"Ristrutturazione Piazza","index":23,"n_rows":18,"n_cols":30,"rows_kept":18,"cut":false,"hidden":false,"merged":[[0,5,0,6],[0,7,0,11]]}
["Oggi è",null,"Totale uscite",null,null,{"$f":"MONTH(Tabelle!G2)","v":3},null,{"$f":"Tabelle!G2","v":"2024-03-31"}]
[{"$f":"TODAY()","v":"2024-03-31"},null,{"$f":"SUM(C6:C64930)","v":3637.64},null,null,{"$f":"VLOOKUP(A2,A6:C39,5)","v":{"$error":"#REF!"}}]
[null,null,null,null,null,"LUN","MAR","MER","GIO","VEN","SAB","DOM"]
["DATA","OPERAZIONE","DARE",null,null,{"$f":"DATE(YEAR(H1),MONTH(H1),1)-WEEKDAY(DATE(YEAR(H1),MONTH(H1),1),2)+1","v":"2024-02-26"},{"$f":"F4+1","v":"2024-02-27"},"2024-02-28","2024-02-29","2024-03-01","2024-03-02","2024-03-03"]
[null,null,null,null,null,{"$f":"L4+1","v":"2024-03-04"},"2024-03-05","2024-03-06","2024-03-07","2024-03-08","2024-03-09","2024-03-10",null,null,null,null,null,null,null,null,null,null,null,"Giorni","Numeri","Numeri Per Calcolo Interessi","Interessi Lordi","Interessi Netti","Tasso Interessi","Ritenuta"]
["2017-09-14","Varie",90.85,null,null,{"$f":"L5+1","v":"2024-03-11"},"2024-03-12","2024-03-13","2024-03-14","2024-03-15","2024-03-16","2024-03-17",null,null,null,null,null,null,null,null,null,null,null,{"$f":"IF(#REF!-A6<0,0,SUM(#REF!-A6))","v":{"$error":"#REF!"}},{"$f":"SUM(C6:C6)","v":90.85},{"$f":"#REF!*X6","v":{"$error":"#REF!"}},{"$f":"(Z6*AC6/100)/365","v":{"$error":"#REF!"}},{"$f":"AA6-AD6","v":{"$error":"#REF!"}},1,{"$f":"(AA6*27/100)","v":{"$error":"#REF!"}}]
{"$rows_left_out":13}
{"sheet":"Piano ammortamento","index":24,"n_rows":56,"n_cols":7,"rows_kept":56,"cut":false,"hidden":false,"merged":[[0,1,0,6]]}
[null,"Piano di ammortamento di un prestito a rate costanti"]
[]
[null,"Importo prestito",30000,"Durata in anni",5,"Data Prestito","2021-12-01"]
[null,"Tasso annuo",4.4999999999999998E-2,"N. rate in un anno",12]
[]
[null,"N. rata","Scandenza","Importo rata","Quota capitale","Quota interessi","Debito residuo"]
{"$rows_left_out":51}
{"sheet":"Foglio1","index":25,"n_rows":843,"n_cols":12,"rows_kept":843,"cut":false,"hidden":false,"merged":[[7,9,10,9],[12,9,13,9]]}
["Loan Amortization Schedule"]
["https://www.vertex42.com/ExcelTemplates/loan-amortization-schedule.html",null,null,null,null,null,null,{"$f":"\"© 2008-\" & YEAR(TODAY()) & \" Vertex42 LLC\"","v":"© 2008-2024 Vertex42 LLC"}]
[]
[]
[]
[]
{"$rows_left_out":837}